Reaction Details
TargetCannabinoid receptor 1
LigandBDBM50382751
Substrate/Competitorn/a
Meas. Tech.ChEMBL_815226 (CHEMBL2025417)
IC50 297±n/a nM
Citation Odan, MIshizuka, NHiramatsu, YInagaki, MHashizume, HFujii, YMitsumori, SMorioka, YSoga, MDeguchi, MYasui, KArimura, A Discovery of S-444823, a potent CB1/CB2 dual agonist as an antipruritic agent. Bioorg Med Chem Lett22:2898-901 (2012) 
 
Cannabinoid receptor 1
Name:Cannabinoid receptor 1
Type:G Protein-Coupled Receptor (GPCR)
Mol. Mass.:52868.96
Organism:Homo sapiens (Human)
Description:P21554
Residue:472
BDBM50382751
NameBDBM50382751
Synonyms:CHEMBL2023047
TypeSmall organic molecule
Emp. Form.C28H36N2O4
Mol. Mass.464.5964
SMILESOC(=O)[C@H](Cc1ccccc1)NC(=O)c1cc2CCCCCCc2n(CC2CCCCC2)c1=O