Reaction Details
TargetCannabinoid receptor 2
LigandBDBM50382745
Substrate/Competitorn/a
Meas. Tech.ChEMBL_815228 (CHEMBL2025419)
IC50 15±n/a nM
Citation Odan, MIshizuka, NHiramatsu, YInagaki, MHashizume, HFujii, YMitsumori, SMorioka, YSoga, MDeguchi, MYasui, KArimura, A Discovery of S-444823, a potent CB1/CB2 dual agonist as an antipruritic agent. Bioorg Med Chem Lett22:2898-901 (2012) 
 
Cannabinoid receptor 2
Name:Cannabinoid receptor 2
Type:G Protein-Coupled Receptor (GPCR)
Mol. Mass.:39690.94
Organism:Homo sapiens (Human)
Description:P34972
Residue:360
BDBM50382745
NameBDBM50382745
Synonyms:CHEMBL2023583
TypeSmall organic molecule
Emp. Form.C25H33N3O4S
Mol. Mass.471.612
SMILESOC(=O)CCc1csc(NC(=O)c2cc3CCCCCCc3n(CC3CCCCC3)c2=O)n1