Reaction Details
TargetCalcitonin gene-related peptide type 1 receptor
LigandBDBM50382792
Substrate/Competitorn/a
Meas. Tech.ChEMBL_815266 (CHEMBL2025457)
IC50 0.064±n/a nM
Citation Luo, GChen, LCiviello, RPin, SSXu, CKostich, WKelley, MConway, CMMacor, JEDubowchik, GM Calcitonin gene-related peptide (CGRP) receptor antagonists: pyridine as a replacement for a core amide group. Bioorg Med Chem Lett22:2917-21 (2012) 
 
Calcitonin gene-related peptide type 1 receptor
Name:Calcitonin gene-related peptide type 1 receptor
Type:Enzyme Catalytic Domain
Mol. Mass.:52980.45
Organism:Homo sapiens (Human)
Description:Q16602
Residue:461
BDBM50382792
NameBDBM50382792
Synonyms:CHEMBL2023189
TypeSmall organic molecule
Emp. Form.C33H33ClN6O4
Mol. Mass.613.106
SMILESCN(C)C(=O)c1cc(Cl)nc(c1)[C@@H](Cc1cc(C)c2[nH]ncc2c1)OC(=O)N1CCC(CC1)c1cc2ccccc2[nH]c1=O