Reaction Details
TargetLysosomal Pro-X carboxypeptidase
LigandBDBM50382913
Substrate/Competitorn/a
Meas. Tech.ChEMBL_815279 (CHEMBL2026494)
IC50 0.2±n/a nM
Citation Graham, THLiu, WVerras, ASebhat, IKXiong, YBleasby, KBhatt, URChen, QGarcia-Calvo, MGeissler, WMGorski, JNHe, HLassman, MELisnock, JLi, XShen, ZTong, XTung, ECWiltsie, JXiao, JXie, DXu, SHale, JJPinto, SShen, DM A new class of prolylcarboxypeptidase inhibitors, part 1: discovery and evaluation. Bioorg Med Chem Lett22:2811-7 (2012) 
 
Lysosomal Pro-X carboxypeptidase
Name:Lysosomal Pro-X carboxypeptidase
Type:Enzyme
Mol. Mass.:55805.19
Organism:Homo sapiens (Human)
Description:P42785
Residue:496
BDBM50382913
NameBDBM50382913
Synonyms:CHEMBL2023210
TypeSmall organic molecule
Emp. Form.C29H32ClF3N4O
Mol. Mass.545.039
SMILESCC(C)(C)N1C[C@H]([C@@H](C1)c1ccc(F)cc1F)C(=O)N1CCC(CC1)c1ccnn1-c1ccc(F)c(Cl)c1