Reaction Details
TargetAmine oxidase [flavin-containing] B
LigandBDBM50049240
Substrate/Competitorn/a
Meas. Tech.ChEMBL_819948 (CHEMBL2032535)
Ki 2100±n/a nM
Citation Binda, CAldeco, MGeldenhuys, WJTortorici, MMattevi, AEdmondson, DE Molecular Insights into Human Monoamine Oxidase B Inhibition by the Glitazone Anti-Diabetes Drugs. ACS Med Chem Lett3:39-42 (2012) 
 
Amine oxidase [flavin-containing] B
Name:Amine oxidase [flavin-containing] B
Type:Enzyme
Mol. Mass.:58469.65
Organism:Rattus norvegicus (rat)
Description:P19643
Residue:520
BDBM50049240
NameBDBM50049240
Synonyms:(+-)-5-((4-(2-(5-ethyl-2-pyridinyl)ethoxy)phenyl)methyl)-2,4-thiazolidinedione CHEMBL595 PIOGLITAZONE HYDROCHLORIDE
TypeSmall organic molecule
Emp. Form.C19H20N2O3S
Mol. Mass.356.439
SMILESCCc1ccc(CCOc2ccc(Cc3sc(=O)[nH]c3O)cc2)nc1