Reaction Details
TargetAdenosine receptor A2a
LigandBDBM50382976
Substrate/Competitorn/a
Meas. Tech.ChEMBL_818419 (CHEMBL2034646)
Ki 7079.46±n/a nM
Citation Langmead, CJAndrews, SPCongreve, MErrey, JCHurrell, EMarshall, FHMason, JSRichardson, CMRobertson, NZhukov, AWeir, M Identification of novel adenosine A(2A) receptor antagonists by virtual screening. J Med Chem55:1904-9 (2012) 
 
Adenosine receptor A2a
Name:Adenosine receptor A2a
Type:G Protein-Coupled Receptor (GPCR)
Mol. Mass.:44716.46
Organism:Homo sapiens (Human)
Description:P29274
Residue:412
BDBM50382976
NameBDBM50382976
Synonyms:CHEMBL2030680
TypeSmall organic molecule
Emp. Form.C10H10N2O2S
Mol. Mass.222.264
SMILESNc1cccc(Cc2sc(=O)[nH]c2O)c1