Reaction Details
TargetAdenosine receptor A2a
LigandBDBM50382980
Substrate/Competitorn/a
Meas. Tech.ChEMBL_818419 (CHEMBL2034646)
Ki 1230.27±n/a nM
Citation Langmead, CJAndrews, SPCongreve, MErrey, JCHurrell, EMarshall, FHMason, JSRichardson, CMRobertson, NZhukov, AWeir, M Identification of novel adenosine A(2A) receptor antagonists by virtual screening. J Med Chem55:1904-9 (2012) 
 
Adenosine receptor A2a
Name:Adenosine receptor A2a
Type:G Protein-Coupled Receptor (GPCR)
Mol. Mass.:44716.46
Organism:Homo sapiens (Human)
Description:P29274
Residue:412
BDBM50382980
NameBDBM50382980
Synonyms:CHEMBL2030682
TypeSmall organic molecule
Emp. Form.C20H18FN3O3
Mol. Mass.367.3736
SMILESCOCCN1C(c2c(n[nH]c2C1=O)-c1ccccc1O)c1ccc(F)cc1