Reaction Details
TargetAdenosine receptor A2a
LigandBDBM52091
Substrate/Competitorn/a
Meas. Tech.ChEMBL_818419 (CHEMBL2034646)
Ki 1778.28±n/a nM
Citation Langmead, CJAndrews, SPCongreve, MErrey, JCHurrell, EMarshall, FHMason, JSRichardson, CMRobertson, NZhukov, AWeir, M Identification of novel adenosine A(2A) receptor antagonists by virtual screening. J Med Chem55:1904-9 (2012) 
 
Adenosine receptor A2a
Name:Adenosine receptor A2a
Type:G Protein-Coupled Receptor (GPCR)
Mol. Mass.:44716.46
Organism:Homo sapiens (Human)
Description:P29274
Residue:412
BDBM52091
NameBDBM52091
Synonyms:4-(4-hydroxy-2-methyl-5-propan-2-ylanilino)-5H-1,3-thiazol-2-one 4-(4-hydroxy-5-isopropyl-2-methyl-anilino)-3-thiazolin-2-one CHEMBL1561889 SMR000034713 | cid_659080
TypeSmall organic molecule
Emp. Form.C13H16N2O2S
Mol. Mass.264.343
SMILESCC(C)c1cc(Nc2csc(=O)[nH]2)c(C)cc1O