Reaction Details
TargetRelaxin-3 receptor 1
LigandBDBM50383002
Substrate/Competitorn/a
Meas. Tech.ChEMBL_818425 (CHEMBL2034745)
Ki 2570.4±n/a nM
Citation Shabanpoor, FAkhter Hossain, MRyan, PJBelgi, ALayfield, SKocan, MZhang, SSamuel, CSGundlach, ALBathgate, RASeparovic, FWade, JD Minimization of human relaxin-3 leading to high-affinity analogues with increased selectivity for relaxin-family peptide 3 receptor (RXFP3) over RXFP1. J Med Chem55:1671-81 (2012) 
 
Relaxin-3 receptor 1
Name:Relaxin-3 receptor 1
Type:PROTEIN
Mol. Mass.:51139.41
Organism:Homo sapiens (Human)
Description:ChEMBL_818423
Residue:469
BDBM50383002
NameBDBM50383002
Synonyms:CHEMBL2030699
TypeSmall organic molecule
Emp. Form.C142H225N47O36
Mol. Mass.3166.5992
SMILESCC[C@H](C)[C@H](NC(=O)[C@H](Cc1ccccc1)NC(=O)[C@H](CCC(O)=O)NC(=O)[C@H](CCCN=C(N)N)NC(=O)CNC(=O)[C@H](CO)NC(=O)[C@H](CC(C)C)NC(=O)[C@H](CCCN=C(N)N)NC(=O)[C@@H](NC(=O)CNC(=O)[C@H](Cc1ccc(O)cc1)NC(=O)[C@@H]1CCCN1C(=O)[C@H](C)NC(=O)[C@H](C)NC(=O)[C@@H](N)CCCN=C(N)N)C(C)C)C(=O)N[C@@H](CCCN=C(N)N)C(=O)N[C@@H](C)C(=O)N[C@@H](C(C)C)C(=O)N[C@@H]([C@@H](C)CC)C(=O)N[C@@H](Cc1ccccc1)C(=O)N[C@@H]([C@@H](C)O)C(=O)N[C@@H](CO)C(=O)N[C@@H](CCCN=C(N)N)C(=O)NCC(=O)NCC(=O)N[C@@H](CO)C(=O)N[C@@H](CCCN=C(N)N)C(=O)N[C@@H](Cc1c[nH]c2ccccc12)C(O)=O