Reaction Details
TargetSmoothened homolog
LigandBDBM50249522
Substrate/Competitorn/a
Meas. Tech.ChEMBL_818642 (CHEMBL2033031)
IC50 7±n/a nM
Citation Solinas, AFaure, HRoudaut, HTraiffort, ESchoenfelder, AMann, AManetti, FTaddei, MRuat, M Acylthiourea, acylurea, and acylguanidine derivatives with potent hedgehog inhibiting activity. J Med Chem55:1559-71 (2012) 
 
Smoothened homolog
Name:Smoothened homolog
Type:Protein
Mol. Mass.:86415.51
Organism:Homo sapiens (Human)
Description:Q99835
Residue:787
BDBM50249522
NameBDBM50249522
Synonyms:2-chloro-N-(4-chloro-3-(pyridin-2-yl)phenyl)-4-(methylsulfonyl)benzamide VISMODEGIB
TypeSmall organic molecule
Emp. Form.C19H14Cl2N2O3S
Mol. Mass.421.297
SMILESCS(=O)(=O)c1ccc(C(=O)Nc2ccc(Cl)c(c2)-c2ccccn2)c(Cl)c1