Reaction Details
TargetTyrosine-protein kinase ZAP-70
LigandBDBM4339
Substrate/Competitorn/a
Meas. Tech.ChEMBL_818690 (CHEMBL2033179)
Ki>10000±n/a nM
Citation Anderson, PCDe Sapio, VTurner, KBElmer, SPRoe, DCSchoeniger, JS Identification of binding specificity-determining features in protein families. J Med Chem55:1926-39 (2012) 
 
Tyrosine-protein kinase ZAP-70
Name:Tyrosine-protein kinase ZAP-70
Type:Enzyme
Mol. Mass.:69881.61
Organism:Homo sapiens (Human)
Description:ZAP-70 SH2 domain was expressed and purified from E. coli using O-phospho-L-tyrosine-agarose column.
Residue:619
BDBM4339
NameBDBM4339
Synonyms:(3,4-Dihydroxybenzylidene)malononitrile benzylidenemalononitrile (BMN) deriv. 23 | cid_2052
TypeSmall organic molecule
Emp. Form.C10H6N2O2
Mol. Mass.186.1668
SMILES[#8]-c1ccc(\[#6]=[#6](/C#N)C#N)cc1-[#8]