Reaction Details
TargetTyrosine-protein kinase ZAP-70
LigandBDBM92422
Substrate/Competitorn/a
Meas. Tech.ChEMBL_818690 (CHEMBL2033179)
Ki>10000±n/a nM
Citation Anderson, PCDe Sapio, VTurner, KBElmer, SPRoe, DCSchoeniger, JS Identification of binding specificity-determining features in protein families. J Med Chem55:1926-39 (2012) 
 
Tyrosine-protein kinase ZAP-70
Name:Tyrosine-protein kinase ZAP-70
Type:Enzyme
Mol. Mass.:69881.61
Organism:Homo sapiens (Human)
Description:ZAP-70 SH2 domain was expressed and purified from E. coli using O-phospho-L-tyrosine-agarose column.
Residue:619
BDBM92422
NameBDBM92422
Synonyms:CHEMBL407391 | PU09
TypeSmall organic molecule
Emp. Form.C7H9N5
Mol. Mass.163.1799
SMILESCN(C)c1ncnc2nc[nH]c12