Reaction Details
TargetKinesin-like protein KIF11
LigandBDBM50383083
Substrate/Competitorn/a
Meas. Tech.ChEMBL_818701 (CHEMBL2033190)
IC50 79100±n/a nM
Citation Nagarajan, SSkoufias, DAKozielski, FPae, AN Receptor-ligand interaction-based virtual screening for novel Eg5/kinesin spindle protein inhibitors. J Med Chem55:2561-73 (2012) 
 
Kinesin-like protein KIF11
Name:Kinesin-like protein KIF11
Type:PROTEIN
Mol. Mass.:119138.97
Organism:Homo sapiens (Human)
Description:ChEMBL_1457426
Residue:1056
BDBM50383083
NameBDBM50383083
Synonyms:CHEMBL1551717
TypeSmall organic molecule
Emp. Form.C22H17NO7S
Mol. Mass.439.438
SMILESCOC(=O)c1c(C)oc2c1cc(NS(=O)(=O)c1ccc(cc1)C(O)=O)c1ccccc21