Reaction Details
TargetKinesin-like protein KIF11
LigandBDBM50383086
Substrate/Competitorn/a
Meas. Tech.ChEMBL_818701 (CHEMBL2033190)
IC50 2400±n/a nM
Citation Nagarajan, SSkoufias, DAKozielski, FPae, AN Receptor-ligand interaction-based virtual screening for novel Eg5/kinesin spindle protein inhibitors. J Med Chem55:2561-73 (2012) 
 
Kinesin-like protein KIF11
Name:Kinesin-like protein KIF11
Type:PROTEIN
Mol. Mass.:119138.97
Organism:Homo sapiens (Human)
Description:ChEMBL_1457426
Residue:1056
BDBM50383086
NameBDBM50383086
Synonyms:CHEMBL2031571
TypeSmall organic molecule
Emp. Form.C25H25N3O3S2
Mol. Mass.479.614
SMILESCOc1ccc(NC(=O)Cc2c(O)n(-c3ccccc3)c(=S)n2CCc2sccc2C)cc1