Reaction Details
TargetAlpha-2B adrenergic receptor
LigandBDBM50383117
Substrate/Competitorn/a
Meas. Tech.ChEMBL_818818 (CHEMBL2033604)
Ki>10000±n/a nM
Citation Bao, XLu, SLiow, JSZoghbi, SSJenko, KJClark, DTGladding, RLInnis, RBPike, VW Radiosynthesis and evaluation of an (18)F-labeled positron emission tomography (PET) radioligand for brain histamine subtype-3 receptors based on a nonimidazole 2-aminoethylbenzofuran chemotype. J Med Chem55:2406-15 (2012) 
 
Alpha-2B adrenergic receptor
Name:Alpha-2B adrenergic receptor
Type:Enzyme
Mol. Mass.:49964.20
Organism:Homo sapiens (Human)
Description:P18089
Residue:450
BDBM50383117
NameBDBM50383117
Synonyms:CHEMBL2031737
TypeSmall organic molecule
Emp. Form.C22H22N2O4
Mol. Mass.378.4211
SMILESC[C@@H]1CCCN1CCc1cc2cc(ccc2o1)C(=O)c1ccc(cc1)[N+]([O-])=O