Reaction Details
TargetAlpha-1D adrenergic receptor
LigandBDBM50158610
Substrate/Competitorn/a
Meas. Tech.ChEMBL_818816 (CHEMBL2033602)
Ki>10000±n/a nM
Citation Bao, XLu, SLiow, JSZoghbi, SSJenko, KJClark, DTGladding, RLInnis, RBPike, VW Radiosynthesis and evaluation of an (18)F-labeled positron emission tomography (PET) radioligand for brain histamine subtype-3 receptors based on a nonimidazole 2-aminoethylbenzofuran chemotype. J Med Chem55:2406-15 (2012) 
 
Alpha-1D adrenergic receptor
Name:Alpha-1D adrenergic receptor
Type:Enzyme Catalytic Domain
Mol. Mass.:60485.82
Organism:Homo sapiens (Human)
Description:adrenergic Alpha1D ADRA1D HUMAN::P25100
Residue:572
BDBM50158610
NameBDBM50158610
Synonyms:(4-Fluoro-phenyl)-{2-[2-((R)-2-methyl-pyrrolidin-1-yl)-ethyl]-benzofuran-5-yl}-methanone | CHEMBL555146
TypeSmall organic molecule
Emp. Form.C22H22FNO2
Mol. Mass.351.414
SMILESC[C@@H]1CCCN1CCc1cc2cc(ccc2o1)C(=O)c1ccc(F)cc1