Reaction Details
TargetD(1A) dopamine receptor
LigandBDBM50383117
Substrate/Competitorn/a
Meas. Tech.ChEMBL_818823 (CHEMBL2033609)
Ki>10000±n/a nM
Citation Bao, XLu, SLiow, JSZoghbi, SSJenko, KJClark, DTGladding, RLInnis, RBPike, VW Radiosynthesis and evaluation of an (18)F-labeled positron emission tomography (PET) radioligand for brain histamine subtype-3 receptors based on a nonimidazole 2-aminoethylbenzofuran chemotype. J Med Chem55:2406-15 (2012) 
 
D(1A) dopamine receptor
Name:D(1A) dopamine receptor
Type:Enzyme
Mol. Mass.:49303.43
Organism:Homo sapiens (Human)
Description:P21728
Residue:446
BDBM50383117
NameBDBM50383117
Synonyms:CHEMBL2031737
TypeSmall organic molecule
Emp. Form.C22H22N2O4
Mol. Mass.378.4211
SMILESC[C@@H]1CCCN1CCc1cc2cc(ccc2o1)C(=O)c1ccc(cc1)[N+]([O-])=O