Reaction Details
TargetHistamine H3 receptor
LigandBDBM50383144
Substrate/Competitorn/a
Meas. Tech.ChEMBL_819069 (CHEMBL2034391)
Ki 0.3±n/a nM
Citation Zhou, DGross, JLAdedoyin, ABAschmies, SBBrennan, JBowlby, MDi, LKubek, KPlatt, BJWang, ZZhang, GBrandon, NComery, TARobichaud, AJ 2-(Pyrrolidin-1-yl)ethyl-3,4-dihydroisoquinolin-1(2H)-one derivatives as potent and selective histamine-3 receptor antagonists. J Med Chem55:2452-68 (2012) 
 
Histamine H3 receptor
Name:Histamine H3 receptor
Type:G Protein-Coupled Receptor (GPCR)
Mol. Mass.:48691.47
Organism:Homo sapiens (Human)
Description:Binding assays were using CHO cells stably expressing hH3R receptors.
Residue:445
BDBM50383144
NameBDBM50383144
Synonyms:CHEMBL2031864
TypeSmall organic molecule
Emp. Form.C22H24N4O2
Mol. Mass.376.4516
SMILESC[C@@H]1CCCN1CCN1CCc2cc(Oc3ccc(nc3)C#N)ccc2C1=O