Reaction Details
TargetHistamine H3 receptor
LigandBDBM50383158
Substrate/Competitorn/a
Meas. Tech.ChEMBL_819069 (CHEMBL2034391)
Ki 1.3±n/a nM
Citation Zhou, DGross, JLAdedoyin, ABAschmies, SBBrennan, JBowlby, MDi, LKubek, KPlatt, BJWang, ZZhang, GBrandon, NComery, TARobichaud, AJ 2-(Pyrrolidin-1-yl)ethyl-3,4-dihydroisoquinolin-1(2H)-one derivatives as potent and selective histamine-3 receptor antagonists. J Med Chem55:2452-68 (2012) 
 
Histamine H3 receptor
Name:Histamine H3 receptor
Type:G Protein-Coupled Receptor (GPCR)
Mol. Mass.:48691.47
Organism:Homo sapiens (Human)
Description:Binding assays were using CHO cells stably expressing hH3R receptors.
Residue:445
BDBM50383158
NameBDBM50383158
Synonyms:CHEMBL2031879
TypeSmall organic molecule
Emp. Form.C26H30FN3O2
Mol. Mass.435.5337
SMILESFc1cc(ccc1C(=O)N1CCCC1)-c1ccc2C(=O)N(CCN3CCCC3)CCc2c1