Reaction Details
TargetHistamine H3 receptor
LigandBDBM50383162
Substrate/Competitorn/a
Meas. Tech.ChEMBL_819069 (CHEMBL2034391)
Ki 1±n/a nM
Citation Zhou, DGross, JLAdedoyin, ABAschmies, SBBrennan, JBowlby, MDi, LKubek, KPlatt, BJWang, ZZhang, GBrandon, NComery, TARobichaud, AJ 2-(Pyrrolidin-1-yl)ethyl-3,4-dihydroisoquinolin-1(2H)-one derivatives as potent and selective histamine-3 receptor antagonists. J Med Chem55:2452-68 (2012) 
 
Histamine H3 receptor
Name:Histamine H3 receptor
Type:G Protein-Coupled Receptor (GPCR)
Mol. Mass.:48691.47
Organism:Homo sapiens (Human)
Description:Binding assays were using CHO cells stably expressing hH3R receptors.
Residue:445
BDBM50383162
NameBDBM50383162
Synonyms:CHEMBL2031884
TypeSmall organic molecule
Emp. Form.C25H31N3O2
Mol. Mass.405.5325
SMILESCCNC(=O)c1ccc(cc1)-c1ccc2C(=O)N(CCN3CCC[C@H]3C)CCc2c1