Reaction Details
TargetHistamine H3 receptor
LigandBDBM50383131
Substrate/Competitorn/a
Meas. Tech.ChEMBL_819070 (CHEMBL2034392)
Ki 146±n/a nM
Citation Zhou, DGross, JLAdedoyin, ABAschmies, SBBrennan, JBowlby, MDi, LKubek, KPlatt, BJWang, ZZhang, GBrandon, NComery, TARobichaud, AJ 2-(Pyrrolidin-1-yl)ethyl-3,4-dihydroisoquinolin-1(2H)-one derivatives as potent and selective histamine-3 receptor antagonists. J Med Chem55:2452-68 (2012) 
 
Histamine H3 receptor
Name:Histamine H3 receptor
Type:G Protein-Coupled Receptor (GPCR)
Mol. Mass.:48607.98
Organism:Rattus norvegicus (rat)
Description:n/a
Residue:445
BDBM50383131
NameBDBM50383131
Synonyms:CHEMBL2031754
TypeSmall organic molecule
Emp. Form.C21H22F2N2O
Mol. Mass.356.409
SMILESFc1cc(F)cc(c1)-c1ccc2C(=O)N(CCN3CCCC3)CCc2c1