Reaction Details
TargetHistamine H3 receptor
LigandBDBM50383164
Substrate/Competitorn/a
Meas. Tech.ChEMBL_819070 (CHEMBL2034392)
Ki 153±n/a nM
Citation Zhou, DGross, JLAdedoyin, ABAschmies, SBBrennan, JBowlby, MDi, LKubek, KPlatt, BJWang, ZZhang, GBrandon, NComery, TARobichaud, AJ 2-(Pyrrolidin-1-yl)ethyl-3,4-dihydroisoquinolin-1(2H)-one derivatives as potent and selective histamine-3 receptor antagonists. J Med Chem55:2452-68 (2012) 
 
Histamine H3 receptor
Name:Histamine H3 receptor
Type:G Protein-Coupled Receptor (GPCR)
Mol. Mass.:48607.98
Organism:Rattus norvegicus (rat)
Description:n/a
Residue:445
BDBM50383164
NameBDBM50383164
Synonyms:CHEMBL2031756
TypeSmall organic molecule
Emp. Form.C24H27N3O
Mol. Mass.373.4907
SMILESO=C1N(CCCN2CCCCC2)CCc2cc(ccc12)-c1ccc(cc1)C#N