Reaction Details
TargetPotassium voltage-gated channel subfamily H member 2
LigandBDBM50383160
Substrate/Competitorn/a
Meas. Tech.ChEMBL_819072 (CHEMBL2034394)
IC50 3700±n/a nM
Citation Zhou, DGross, JLAdedoyin, ABAschmies, SBBrennan, JBowlby, MDi, LKubek, KPlatt, BJWang, ZZhang, GBrandon, NComery, TARobichaud, AJ 2-(Pyrrolidin-1-yl)ethyl-3,4-dihydroisoquinolin-1(2H)-one derivatives as potent and selective histamine-3 receptor antagonists. J Med Chem55:2452-68 (2012) 
 
Potassium voltage-gated channel subfamily H member 2
Name:Potassium voltage-gated channel subfamily H member 2
Type:Multi-pass membrane protein
Mol. Mass.:126672.65
Organism:Homo sapiens (Human)
Description:Q12809
Residue:1159
BDBM50383160
NameBDBM50383160
Synonyms:CHEMBL2031881
TypeSmall organic molecule
Emp. Form.C23H26FN3O2
Mol. Mass.395.4698
SMILESCNC(=O)c1ccc(c(F)c1)-c1ccc2C(=O)N(CCN3CCCC3)CCc2c1