Reaction Details
TargetHepatocyte growth factor receptor
LigandBDBM50383177
Substrate/Competitorn/a
Meas. Tech.ChEMBL_819189 (CHEMBL2032458)
IC50 66±n/a nM
Citation Liu, LNorman, MHLee, MXi, NSiegmund, ABoezio, AABooker, SChoquette, DD'Angelo, NDGermain, JYang, KYang, YZhang, YBellon, SFWhittington, DAHarmange, JCDominguez, CKim, TSDussault, I Structure-based design of novel class II c-Met inhibitors: 2. SAR and kinase selectivity profiles of the pyrazolone series. J Med Chem55:1868-97 (2012) 
 
Hepatocyte growth factor receptor
Name:Hepatocyte growth factor receptor
Type:Protein
Mol. Mass.:155559.73
Organism:Homo sapiens (Human)
Description:P08581
Residue:1390
BDBM50383177
NameBDBM50383177
Synonyms:CHEMBL2031907
TypeSmall organic molecule
Emp. Form.C31H30N6O4
Mol. Mass.550.6077
SMILESCOc1ccc2c(Oc3ccc(NC(=O)c4c(CN5CCCC5)n(C)n(-c5ccccc5)c4=O)nc3)ccnc2c1