Reaction Details
TargetHepatocyte growth factor receptor
LigandBDBM50383183
Substrate/Competitorn/a
Meas. Tech.ChEMBL_819189 (CHEMBL2032458)
IC50 83±n/a nM
Citation Liu, LNorman, MHLee, MXi, NSiegmund, ABoezio, AABooker, SChoquette, DD'Angelo, NDGermain, JYang, KYang, YZhang, YBellon, SFWhittington, DAHarmange, JCDominguez, CKim, TSDussault, I Structure-based design of novel class II c-Met inhibitors: 2. SAR and kinase selectivity profiles of the pyrazolone series. J Med Chem55:1868-97 (2012) 
 
Hepatocyte growth factor receptor
Name:Hepatocyte growth factor receptor
Type:Protein
Mol. Mass.:155559.73
Organism:Homo sapiens (Human)
Description:P08581
Residue:1390
BDBM50383183
NameBDBM50383183
Synonyms:CHEMBL2031901
TypeSmall organic molecule
Emp. Form.C27H23N5O4
Mol. Mass.481.5026
SMILESCOc1ccc2c(Oc3ccc(NC(=O)c4c(C)n(C)n(-c5ccccc5)c4=O)nc3)ccnc2c1