Reaction Details
TargetHepatocyte growth factor receptor
LigandBDBM50383206
Substrate/Competitorn/a
Meas. Tech.ChEMBL_819184 (CHEMBL2034704)
Ki 0.700000±n/a nM
Citation Liu, LNorman, MHLee, MXi, NSiegmund, ABoezio, AABooker, SChoquette, DD'Angelo, NDGermain, JYang, KYang, YZhang, YBellon, SFWhittington, DAHarmange, JCDominguez, CKim, TSDussault, I Structure-based design of novel class II c-Met inhibitors: 2. SAR and kinase selectivity profiles of the pyrazolone series. J Med Chem55:1868-97 (2012) 
 
Hepatocyte growth factor receptor
Name:Hepatocyte growth factor receptor
Type:Protein
Mol. Mass.:155559.73
Organism:Homo sapiens (Human)
Description:P08581
Residue:1390
BDBM50383206
NameBDBM50383206
Synonyms:CHEMBL2032019
TypeSmall organic molecule
Emp. Form.C30H24N6O4S
Mol. Mass.564.614
SMILESCOc1ccc2c(Oc3ccc(NC(=O)c4c(-c5csc(C)n5)n(C)n(-c5ccccc5)c4=O)nc3)ccnc2c1