Reaction Details
TargetHepatocyte growth factor receptor
LigandBDBM50383173
Substrate/Competitorn/a
Meas. Tech.ChEMBL_819184 (CHEMBL2034704)
IC50 65±n/a nM
Citation Liu, LNorman, MHLee, MXi, NSiegmund, ABoezio, AABooker, SChoquette, DD'Angelo, NDGermain, JYang, KYang, YZhang, YBellon, SFWhittington, DAHarmange, JCDominguez, CKim, TSDussault, I Structure-based design of novel class II c-Met inhibitors: 2. SAR and kinase selectivity profiles of the pyrazolone series. J Med Chem55:1868-97 (2012) 
 
Hepatocyte growth factor receptor
Name:Hepatocyte growth factor receptor
Type:Protein
Mol. Mass.:155559.73
Organism:Homo sapiens (Human)
Description:P08581
Residue:1390
BDBM50383173
NameBDBM50383173
Synonyms:CHEMBL2031911
TypeSmall organic molecule
Emp. Form.C31H27FN4O5
Mol. Mass.554.5683
SMILESCOc1ccc2c(Oc3ccc(NC(=O)c4c(C5CCCO5)n(C)n(-c5ccccc5)c4=O)cc3F)ccnc2c1