Reaction Details
TargetVascular endothelial growth factor receptor 2
LigandBDBM50383195
Substrate/Competitorn/a
Meas. Tech.ChEMBL_819185 (CHEMBL2032454)
Ki 382±n/a nM
Citation Liu, LNorman, MHLee, MXi, NSiegmund, ABoezio, AABooker, SChoquette, DD'Angelo, NDGermain, JYang, KYang, YZhang, YBellon, SFWhittington, DAHarmange, JCDominguez, CKim, TSDussault, I Structure-based design of novel class II c-Met inhibitors: 2. SAR and kinase selectivity profiles of the pyrazolone series. J Med Chem55:1868-97 (2012) 
 
Vascular endothelial growth factor receptor 2
Name:Vascular endothelial growth factor receptor 2
Type:Receptor Tyrosine Kinase
Mol. Mass.:151510.97
Organism:Homo sapiens (Human)
Description:P35968
Residue:1356
BDBM50383195
NameBDBM50383195
Synonyms:CHEMBL2032031
TypeSmall organic molecule
Emp. Form.C30H28FN5O5
Mol. Mass.557.5722
SMILESCOc1ccc2c(Oc3ccc(NC(=O)c4c(C)n(CC(O)CN)n(-c5ccccc5)c4=O)cc3F)ccnc2c1