Reaction Details
TargetVascular endothelial growth factor receptor 2
LigandBDBM50383168
Substrate/Competitorn/a
Meas. Tech.ChEMBL_819185 (CHEMBL2032454)
Ki 1380±n/a nM
Citation Liu, LNorman, MHLee, MXi, NSiegmund, ABoezio, AABooker, SChoquette, DD'Angelo, NDGermain, JYang, KYang, YZhang, YBellon, SFWhittington, DAHarmange, JCDominguez, CKim, TSDussault, I Structure-based design of novel class II c-Met inhibitors: 2. SAR and kinase selectivity profiles of the pyrazolone series. J Med Chem55:1868-97 (2012) 
 
Vascular endothelial growth factor receptor 2
Name:Vascular endothelial growth factor receptor 2
Type:Receptor Tyrosine Kinase
Mol. Mass.:151510.97
Organism:Homo sapiens (Human)
Description:P35968
Residue:1356
BDBM50383168
NameBDBM50383168
Synonyms:CHEMBL2032015
TypeSmall organic molecule
Emp. Form.C31H24N6O4
Mol. Mass.544.5601
SMILESCOc1ccc2c(Oc3ccc(NC(=O)c4c(-c5ccccn5)n(C)n(-c5ccccc5)c4=O)nc3)ccnc2c1