Reaction Details
TargetTyrosine-protein kinase ABL1
LigandBDBM50383191
Substrate/Competitorn/a
Meas. Tech.ChEMBL_819195 (CHEMBL2032464)
IC50 10±n/a nM
Citation Liu, LNorman, MHLee, MXi, NSiegmund, ABoezio, AABooker, SChoquette, DD'Angelo, NDGermain, JYang, KYang, YZhang, YBellon, SFWhittington, DAHarmange, JCDominguez, CKim, TSDussault, I Structure-based design of novel class II c-Met inhibitors: 2. SAR and kinase selectivity profiles of the pyrazolone series. J Med Chem55:1868-97 (2012) 
 
Tyrosine-protein kinase ABL1
Name:Tyrosine-protein kinase ABL1
Type:Enzyme
Mol. Mass.:122897.30
Organism:Homo sapiens (Human)
Description:P00519
Residue:1130
BDBM50383191
NameBDBM50383191
Synonyms:CHEMBL2031893
TypeSmall organic molecule
Emp. Form.C29H25FN4O5
Mol. Mass.528.531
SMILESCOc1cc2nccc(Oc3ccc(NC(=O)c4c(C)n(C)n(-c5ccccc5)c4=O)cc3F)c2cc1OC