Reaction Details
TargetHepatocyte growth factor receptor
LigandBDBM24766
Substrate/Competitorn/a
Meas. Tech.ChEMBL_819216 (CHEMBL2032485)
Ki 14±n/a nM
Citation Norman, MHLiu, LLee, MXi, NFellows, ID'Angelo, NDDominguez, CRex, KBellon, SFKim, TSDussault, I Structure-based design of novel class II c-Met inhibitors: 1. Identification of pyrazolone-based derivatives. J Med Chem55:1858-67 (2012) 
 
Hepatocyte growth factor receptor
Name:Hepatocyte growth factor receptor
Type:Protein
Mol. Mass.:155559.73
Organism:Homo sapiens (Human)
Description:P08581
Residue:1390
BDBM24766
NameBDBM24766
Synonyms:5-{4-[(6,7-dimethoxyquinolin-4-yl)oxy]-3-fluorophenyl}-3-methyl-2-(phenylamino)-3,4-dihydropyrimidin-4-one | pyrimidone, 48
TypeSmall organic molecule
Emp. Form.C28H23FN4O4
Mol. Mass.498.505
SMILESCOc1cc2nccc(Oc3ccc(cc3F)-c3cnc(Nc4ccccc4)n(C)c3=O)c2cc1OC