Reaction Details
TargetLysosomal acid glucosylceramidase
LigandBDBM50383315
Substrate/Competitorn/a
Meas. Tech.ChEMBL_820004 (CHEMBL2032679)
pH5±n/a
Ki 0.4±n/a nM
Commentsextracted
Citation Goddard-Borger, EDTropak, MBYonekawa, STysoe, CMahuran, DJWithers, SG Rapid assembly of a library of lipophilic iminosugars via the thiol-ene reaction yields promising pharmacological chaperones for the treatment of Gaucher disease. J Med Chem55:2737-45 (2012) 
 
Lysosomal acid glucosylceramidase
Name:Lysosomal acid glucosylceramidase
Type:Enzyme
Mol. Mass.:59724.64
Organism:Homo sapiens (Human)
Description:The beta-Glu activity was measured with commercially available beta-glucocerebrosidase (Ceredase) as the enzyme source.
Residue:536
BDBM50383315
NameBDBM50383315
Synonyms:CHEMBL2029773
TypeSmall organic molecule
Emp. Form.C15H31NO3S
Mol. Mass.305.477
SMILESCCCCCCCCSCC[C@H]1NC[C@@H](O)[C@H](O)[C@H]1O