Reaction Details
TargetProto-oncogene tyrosine-protein kinase Src
LigandBDBM50345735
Substrate/Competitorn/a
Meas. Tech.ChEMBL_818068 (CHEMBL2033710)
Ki 650±n/a nM
Citation Larson, ETOjo, KKMurphy, RCJohnson, SMZhang, ZKim, JELeibly, DJFox, AMReid, MCDale, EJPerera, BGKim, JHewitt, SNHol, WGVerlinde, CLFan, EVan Voorhis, WCMaly, DJMerritt, EA Multiple determinants for selective inhibition of apicomplexan calcium-dependent protein kinase CDPK1. J Med Chem55:2803-10 (2012) 
 
Proto-oncogene tyrosine-protein kinase Src
Name:Proto-oncogene tyrosine-protein kinase Src
Type:Protein
Mol. Mass.:59838.60
Organism:Homo sapiens (Human)
Description:P12931
Residue:536
BDBM50345735
NameBDBM50345735
Synonyms:1-isopropyl-3-(4-methoxy-3-methylphenyl)-1H-pyrazolo[3,4-d]pyrimidin-4-amine CHEMBL2069943 US11247972, Compound 7m | US9765037, Compound 7m
TypeSmall organic molecule
Emp. Form.C16H19N5O
Mol. Mass.297.355
SMILESCOc1ccc(cc1C)-c1nn(C(C)C)c2ncnc(N)c12