Reaction Details
TargetTyrosine-protein kinase ABL1
LigandBDBM50383375
Substrate/Competitorn/a
Meas. Tech.ChEMBL_818069 (CHEMBL2033711)
Ki>10000±n/a nM
Citation Larson, ETOjo, KKMurphy, RCJohnson, SMZhang, ZKim, JELeibly, DJFox, AMReid, MCDale, EJPerera, BGKim, JHewitt, SNHol, WGVerlinde, CLFan, EVan Voorhis, WCMaly, DJMerritt, EA Multiple determinants for selective inhibition of apicomplexan calcium-dependent protein kinase CDPK1. J Med Chem55:2803-10 (2012) 
 
Tyrosine-protein kinase ABL1
Name:Tyrosine-protein kinase ABL1
Type:Enzyme
Mol. Mass.:122897.30
Organism:Homo sapiens (Human)
Description:P00519
Residue:1130
BDBM50383375
NameBDBM50383375
Synonyms:CHEMBL2030559 US10544104, Compound 99 | US9765037, Compound 99
TypeSmall organic molecule
Emp. Form.C11H16N6
Mol. Mass.232.2849
SMILESNc1ncnc2n(CC3CCNCC3)ncc12