Reaction Details
TargetTyrosine-protein kinase ABL1
LigandBDBM50383380
Substrate/Competitorn/a
Meas. Tech.ChEMBL_818069 (CHEMBL2033711)
Ki>15000±n/a nM
Citation Larson, ETOjo, KKMurphy, RCJohnson, SMZhang, ZKim, JELeibly, DJFox, AMReid, MCDale, EJPerera, BGKim, JHewitt, SNHol, WGVerlinde, CLFan, EVan Voorhis, WCMaly, DJMerritt, EA Multiple determinants for selective inhibition of apicomplexan calcium-dependent protein kinase CDPK1. J Med Chem55:2803-10 (2012) 
 
Tyrosine-protein kinase ABL1
Name:Tyrosine-protein kinase ABL1
Type:Enzyme
Mol. Mass.:122897.30
Organism:Homo sapiens (Human)
Description:P00519
Residue:1130
BDBM50383380
NameBDBM50383380
Synonyms:CHEMBL2030553 US10544104, Compound 28 US9765037, Compound 28
TypeSmall organic molecule
Emp. Form.C22H24N6O
Mol. Mass.388.4656
SMILESCOc1ccc2cc(ccc2c1)-c1nn(CC2CCNCC2)c2ncnc(N)c12