Reaction Details
TargetProto-oncogene tyrosine-protein kinase Src
LigandBDBM50345740
Substrate/Competitorn/a
Meas. Tech.ChEMBL_818068 (CHEMBL2033710)
Ki 200±n/a nM
Citation Larson, ETOjo, KKMurphy, RCJohnson, SMZhang, ZKim, JELeibly, DJFox, AMReid, MCDale, EJPerera, BGKim, JHewitt, SNHol, WGVerlinde, CLFan, EVan Voorhis, WCMaly, DJMerritt, EA Multiple determinants for selective inhibition of apicomplexan calcium-dependent protein kinase CDPK1. J Med Chem55:2803-10 (2012) 
 
Proto-oncogene tyrosine-protein kinase Src
Name:Proto-oncogene tyrosine-protein kinase Src
Type:Protein
Mol. Mass.:59838.60
Organism:Homo sapiens (Human)
Description:P12931
Residue:536
BDBM50345740
NameBDBM50345740
Synonyms:3-(6-ethoxynaphthalen-2-yl)-1-isopropyl-1H-pyrazolo[3,4-d]pyrimidin-4-amine CHEMBL2070048 US11247972, Compound 7r | US9765037, Compound 7r
TypeSmall organic molecule
Emp. Form.C20H21N5O
Mol. Mass.347.4136
SMILESCCOc1ccc2cc(ccc2c1)-c1nn(C(C)C)c2ncnc(N)c12