Reaction Details
TargetProto-oncogene tyrosine-protein kinase Src
LigandBDBM50383382
Substrate/Competitorn/a
Meas. Tech.ChEMBL_818068 (CHEMBL2033710)
Ki 1240±n/a nM
Citation Larson, ETOjo, KKMurphy, RCJohnson, SMZhang, ZKim, JELeibly, DJFox, AMReid, MCDale, EJPerera, BGKim, JHewitt, SNHol, WGVerlinde, CLFan, EVan Voorhis, WCMaly, DJMerritt, EA Multiple determinants for selective inhibition of apicomplexan calcium-dependent protein kinase CDPK1. J Med Chem55:2803-10 (2012) 
 
Proto-oncogene tyrosine-protein kinase Src
Name:Proto-oncogene tyrosine-protein kinase Src
Type:Protein
Mol. Mass.:59838.60
Organism:Homo sapiens (Human)
Description:P12931
Residue:536
BDBM50383382
NameBDBM50383382
Synonyms:CHEMBL2030556 US10172858, Table 2.9 US11247972, Compound 26 US9828378, # 9
TypeSmall organic molecule
Emp. Form.C16H15ClN6
Mol. Mass.326.784
SMILESCC(C)n1nc(-c2cc3c(Cl)cccc3[nH]2)c2c(N)ncnc12