Reaction Details
TargetTyrosine-protein kinase ABL1
LigandBDBM50383382
Substrate/Competitorn/a
Meas. Tech.ChEMBL_818069 (CHEMBL2033711)
Ki 280±n/a nM
Citation Larson, ETOjo, KKMurphy, RCJohnson, SMZhang, ZKim, JELeibly, DJFox, AMReid, MCDale, EJPerera, BGKim, JHewitt, SNHol, WGVerlinde, CLFan, EVan Voorhis, WCMaly, DJMerritt, EA Multiple determinants for selective inhibition of apicomplexan calcium-dependent protein kinase CDPK1. J Med Chem55:2803-10 (2012) 
 
Tyrosine-protein kinase ABL1
Name:Tyrosine-protein kinase ABL1
Type:Enzyme
Mol. Mass.:122897.30
Organism:Homo sapiens (Human)
Description:P00519
Residue:1130
BDBM50383382
NameBDBM50383382
Synonyms:CHEMBL2030556 US10172858, Table 2.9 US11247972, Compound 26 US9828378, # 9
TypeSmall organic molecule
Emp. Form.C16H15ClN6
Mol. Mass.326.784
SMILESCC(C)n1nc(-c2cc3c(Cl)cccc3[nH]2)c2c(N)ncnc12