Reaction Details
TargetCannabinoid receptor 1
LigandBDBM50383399
Substrate/Competitorn/a
Meas. Tech.ChEMBL_818077 (CHEMBL2033719)
Ki 7.6±n/a nM
Citation Fulp, ABortoff, KSeltzman, HZhang, YMathews, JSnyder, RFennell, TMaitra, R Design and synthesis of cannabinoid receptor 1 antagonists for peripheral selectivity. J Med Chem55:2820-34 (2012) 
 
Cannabinoid receptor 1
Name:Cannabinoid receptor 1
Type:G Protein-Coupled Receptor (GPCR)
Mol. Mass.:52868.96
Organism:Homo sapiens (Human)
Description:P21554
Residue:472
BDBM50383399
NameBDBM50383399
Synonyms:CHEMBL2030751
TypeSmall organic molecule
Emp. Form.C32H32Cl3N5O2
Mol. Mass.624.988
SMILESCCCNC(=O)NC1(CCN(CC1)C(=O)c1nn(c(c1C)-c1ccc(Cl)cc1)-c1ccc(Cl)cc1Cl)c1ccccc1