Reaction Details
TargetCannabinoid receptor 1
LigandBDBM50383412
Substrate/Competitorn/a
Meas. Tech.ChEMBL_818077 (CHEMBL2033719)
Ki 22.3±n/a nM
Citation Fulp, ABortoff, KSeltzman, HZhang, YMathews, JSnyder, RFennell, TMaitra, R Design and synthesis of cannabinoid receptor 1 antagonists for peripheral selectivity. J Med Chem55:2820-34 (2012) 
 
Cannabinoid receptor 1
Name:Cannabinoid receptor 1
Type:G Protein-Coupled Receptor (GPCR)
Mol. Mass.:52868.96
Organism:Homo sapiens (Human)
Description:P21554
Residue:472
BDBM50383412
NameBDBM50383412
Synonyms:CHEMBL2030930
TypeSmall organic molecule
Emp. Form.C27H29Cl3N4O3
Mol. Mass.563.903
SMILESCc1c(nn(c1-c1ccc(Cl)cc1)-c1ccc(Cl)cc1Cl)C(=O)N[C@@H]1CCCN(C1)C(=O)OC(C)(C)C