Reaction Details
TargetCannabinoid receptor 1
LigandBDBM50383417
Substrate/Competitorn/a
Meas. Tech.ChEMBL_818077 (CHEMBL2033719)
Ki 17.5±n/a nM
Citation Fulp, ABortoff, KSeltzman, HZhang, YMathews, JSnyder, RFennell, TMaitra, R Design and synthesis of cannabinoid receptor 1 antagonists for peripheral selectivity. J Med Chem55:2820-34 (2012) 
 
Cannabinoid receptor 1
Name:Cannabinoid receptor 1
Type:G Protein-Coupled Receptor (GPCR)
Mol. Mass.:52868.96
Organism:Homo sapiens (Human)
Description:P21554
Residue:472
BDBM50383417
NameBDBM50383417
Synonyms:CHEMBL2030939
TypeSmall organic molecule
Emp. Form.C25H25Cl3N4O3
Mol. Mass.535.85
SMILESCCOC(=O)N1CCC[C@H](C1)NC(=O)c1nn(c(c1C)-c1ccc(Cl)cc1)-c1ccc(Cl)cc1Cl