Reaction Details
TargetCannabinoid receptor 2
LigandBDBM50383390
Substrate/Competitorn/a
Meas. Tech.ChEMBL_818078 (CHEMBL2033720)
Ki 2110±n/a nM
Citation Fulp, ABortoff, KSeltzman, HZhang, YMathews, JSnyder, RFennell, TMaitra, R Design and synthesis of cannabinoid receptor 1 antagonists for peripheral selectivity. J Med Chem55:2820-34 (2012) 
 
Cannabinoid receptor 2
Name:Cannabinoid receptor 2
Type:G Protein-Coupled Receptor (GPCR)
Mol. Mass.:39690.94
Organism:Homo sapiens (Human)
Description:P34972
Residue:360
BDBM50383390
NameBDBM50383390
Synonyms:CHEMBL2030740
TypeSmall organic molecule
Emp. Form.C33H33Cl3N4O3
Mol. Mass.639.999
SMILESCc1c(nn(c1-c1ccc(Cl)cc1)-c1ccc(Cl)cc1Cl)C(=O)N1CCC(CC1)(NC(=O)OC(C)(C)C)c1ccccc1