Reaction Details
TargetCannabinoid receptor 2
LigandBDBM50383404
Substrate/Competitorn/a
Meas. Tech.ChEMBL_818078 (CHEMBL2033720)
Ki 3349±n/a nM
Citation Fulp, ABortoff, KSeltzman, HZhang, YMathews, JSnyder, RFennell, TMaitra, R Design and synthesis of cannabinoid receptor 1 antagonists for peripheral selectivity. J Med Chem55:2820-34 (2012) 
 
Cannabinoid receptor 2
Name:Cannabinoid receptor 2
Type:G Protein-Coupled Receptor (GPCR)
Mol. Mass.:39690.94
Organism:Homo sapiens (Human)
Description:P34972
Residue:360
BDBM50383404
NameBDBM50383404
Synonyms:CHEMBL2030759
TypeSmall organic molecule
Emp. Form.C27H30Cl3N5O2
Mol. Mass.562.918
SMILESCc1c(nn(c1-c1ccc(Cl)cc1)-c1ccc(Cl)cc1Cl)C(=O)NC1CCN(CC1)C(=O)NC(C)(C)C