Reaction Details
TargetLysosomal Pro-X carboxypeptidase
LigandBDBM50383425
Substrate/Competitorn/a
Meas. Tech.ChEMBL_818260 (CHEMBL2034221)
IC50 0.5±n/a nM
Citation Graham, THLiu, WVerras, AReibarkh, MBleasby, KBhatt, URChen, QGarcia-Calvo, MGeissler, WMGorski, JNHe, HLassman, MELisnock, JLi, XShen, ZTong, XTung, ECWiltsie, JXie, DXu, SXiao, JHale, JJPinto, SShen, DM A new class of prolylcarboxypeptidase inhibitors, part 2: the aminocyclopentanes. Bioorg Med Chem Lett22:2818-22 (2012) 
 
Lysosomal Pro-X carboxypeptidase
Name:Lysosomal Pro-X carboxypeptidase
Type:PROTEIN
Mol. Mass.:55028.96
Organism:Mus musculus
Description:ChEMBL_1335505
Residue:491
BDBM50383425
NameBDBM50383425
Synonyms:CHEMBL2031590
TypeSmall organic molecule
Emp. Form.C30H34ClF3N4O
Mol. Mass.559.065
SMILESCN(C)[C@]1(C)C[C@H]([C@@H](C1)c1ccc(F)cc1F)C(=O)N1CCC(CC1)c1cc(C)nn1-c1ccc(F)c(Cl)c1