Reaction Details
TargetLysosomal Pro-X carboxypeptidase
LigandBDBM50382906
Substrate/Competitorn/a
Meas. Tech.ChEMBL_818260 (CHEMBL2034221)
IC50 0.4±n/a nM
Citation Graham, THLiu, WVerras, AReibarkh, MBleasby, KBhatt, URChen, QGarcia-Calvo, MGeissler, WMGorski, JNHe, HLassman, MELisnock, JLi, XShen, ZTong, XTung, ECWiltsie, JXie, DXu, SXiao, JHale, JJPinto, SShen, DM A new class of prolylcarboxypeptidase inhibitors, part 2: the aminocyclopentanes. Bioorg Med Chem Lett22:2818-22 (2012) 
 
Lysosomal Pro-X carboxypeptidase
Name:Lysosomal Pro-X carboxypeptidase
Type:PROTEIN
Mol. Mass.:55028.96
Organism:Mus musculus
Description:ChEMBL_1335505
Residue:491
BDBM50382906
NameBDBM50382906
Synonyms:CHEMBL2023202
TypeSmall organic molecule
Emp. Form.C30H34Cl2F2N4O
Mol. Mass.575.52
SMILESCc1cc(C2CCN(CC2)C(=O)[C@@H]2CN(C[C@H]2c2ccc(F)cc2F)C(C)(C)C)n(n1)-c1cc(Cl)ccc1Cl