Reaction Details
TargetBifunctional epoxide hydrolase 2
LigandBDBM50383472
Substrate/Competitorn/a
Meas. Tech.ChEMBL_818494 (CHEMBL2032586)
IC50 1.6±n/a nM
Citation Scherman, MSNorth, EJJones, VHess, TNGrzegorzewicz, AEKasagami, TKim, IHMerzlikin, OLenaerts, AJLee, REJackson, MMorisseau, CMcNeil, MR Screening a library of 1600 adamantyl ureas for anti-Mycobacterium tuberculosis activity in vitro and for better physical chemical properties for bioavailability. Bioorg Med Chem20:3255-62 (2012) 
 
Bifunctional epoxide hydrolase 2
Name:Bifunctional epoxide hydrolase 2
Type:Enzyme
Mol. Mass.:62613.07
Organism:Homo sapiens (Human)
Description:P34913
Residue:555
BDBM50383472
NameBDBM50383472
Synonyms:CHEMBL2031814
TypeSmall organic molecule
Emp. Form.C24H26N2O2
Mol. Mass.374.4754
SMILESO=C(Nc1ccc(cc1)C(=O)c1ccccc1)NC12CC3CC(CC(C3)C1)C2