Reaction Details
TargetMuscarinic acetylcholine receptor M2
LigandBDBM50383522
Substrate/Competitorn/a
Meas. Tech.ChEMBL_818587 (CHEMBL2032874)
Ki>2000±n/a nM
Citation Mihalic, JTFan, PChen, XChen, XFu, YMotani, ALiang, LLindstrom, MTang, LChen, JLJaen, JDai, KLi, L Discovery of a novel melanin concentrating hormone receptor 1 (MCHR1) antagonist with reduced hERG inhibition. Bioorg Med Chem Lett22:3781-5 (2012) 
 
Muscarinic acetylcholine receptor M2
Name:Muscarinic acetylcholine receptor M2
Type:GPCR
Mol. Mass.:51730.61
Organism:Homo sapiens (Human)
Description:P08172
Residue:466
BDBM50383522
NameBDBM50383522
Synonyms:CHEMBL2032049
TypeSmall organic molecule
Emp. Form.C26H33F3N2O2
Mol. Mass.462.5476
SMILESC[C@@H]1[C@H]2CN(CCC3(CCCCC3)C(O)=O)CC[C@@H]2Cc2[nH]c3ccc(cc3c12)C(F)(F)F