Reaction Details
TargetMelanin-concentrating hormone receptor 1
LigandBDBM50383522
Substrate/Competitorn/a
Meas. Tech.ChEMBL_818576 (CHEMBL2032863)
IC50 0.8±n/a nM
Citation Mihalic, JTFan, PChen, XChen, XFu, YMotani, ALiang, LLindstrom, MTang, LChen, JLJaen, JDai, KLi, L Discovery of a novel melanin concentrating hormone receptor 1 (MCHR1) antagonist with reduced hERG inhibition. Bioorg Med Chem Lett22:3781-5 (2012) 
 
Melanin-concentrating hormone receptor 1
Name:Melanin-concentrating hormone receptor 1
Type:PROTEIN
Mol. Mass.:42789.69
Organism:Macaca mulatta
Description:ChEMBL_818576
Residue:388
BDBM50383522
NameBDBM50383522
Synonyms:CHEMBL2032049
TypeSmall organic molecule
Emp. Form.C26H33F3N2O2
Mol. Mass.462.5476
SMILESC[C@@H]1[C@H]2CN(CCC3(CCCCC3)C(O)=O)CC[C@@H]2Cc2[nH]c3ccc(cc3c12)C(F)(F)F