Reaction Details
Target5-hydroxytryptamine receptor 2A
LigandBDBM50383522
Substrate/Competitorn/a
Meas. Tech.ChEMBL_818579 (CHEMBL2032866)
Ki>2000±n/a nM
Citation Mihalic, JTFan, PChen, XChen, XFu, YMotani, ALiang, LLindstrom, MTang, LChen, JLJaen, JDai, KLi, L Discovery of a novel melanin concentrating hormone receptor 1 (MCHR1) antagonist with reduced hERG inhibition. Bioorg Med Chem Lett22:3781-5 (2012) 
 
5-hydroxytryptamine receptor 2A
Name:5-hydroxytryptamine receptor 2A
Type:undefined
Mol. Mass.:52607.65
Organism:Homo sapiens (Human)
Description:P28223
Residue:471
BDBM50383522
NameBDBM50383522
Synonyms:CHEMBL2032049
TypeSmall organic molecule
Emp. Form.C26H33F3N2O2
Mol. Mass.462.5476
SMILESC[C@@H]1[C@H]2CN(CCC3(CCCCC3)C(O)=O)CC[C@@H]2Cc2[nH]c3ccc(cc3c12)C(F)(F)F