Reaction Details
TargetD(2) dopamine receptor
LigandBDBM50383522
Substrate/Competitorn/a
Meas. Tech.ChEMBL_818583 (CHEMBL2032870)
Ki 3160±n/a nM
Citation Mihalic, JTFan, PChen, XChen, XFu, YMotani, ALiang, LLindstrom, MTang, LChen, JLJaen, JDai, KLi, L Discovery of a novel melanin concentrating hormone receptor 1 (MCHR1) antagonist with reduced hERG inhibition. Bioorg Med Chem Lett22:3781-5 (2012) 
 
D(2) dopamine receptor
Name:D(2) dopamine receptor
Type:Cell-surface receptors
Mol. Mass.:50647.10
Organism:Homo sapiens (Human)
Description:P14416
Residue:443
BDBM50383522
NameBDBM50383522
Synonyms:CHEMBL2032049
TypeSmall organic molecule
Emp. Form.C26H33F3N2O2
Mol. Mass.462.5476
SMILESC[C@@H]1[C@H]2CN(CCC3(CCCCC3)C(O)=O)CC[C@@H]2Cc2[nH]c3ccc(cc3c12)C(F)(F)F